Missing dependencies

1 job for add-gitlab-ci in 5 minutes and 16 seconds (queued for 3 seconds)
Status Name Job ID Coverage
  Test
failed test #19

00:05:16

 
Name Stage Failure
failed
test Test
cd share && make all
make[2]: Entering directory '/builds/zonemaster/zonemaster-backend/zonemaster-engine/share'
make[2]: msgfmt: No such file or directory
make[2]: *** [GNUmakefile:32: da.mo] Error 127
make[1]: *** [Makefile:779: pure_all] Error 2
make[2]: Leaving directory '/builds/zonemaster/zonemaster-backend/zonemaster-engine/share'
make[1]: Leaving directory '/builds/zonemaster/zonemaster-backend/zonemaster-engine'
make: *** [Makefile:518: subdirs] Error 2
Cleaning up file based variables
ERROR: Job failed: exit code 1