Install git

1 job for add-gitlab-ci in 5 minutes and 23 seconds (queued for 8 seconds)
Status Name Job ID Coverage
  Test
failed test #13

00:05:23

 
Name Stage Failure
failed
test Test
cd share && make all
make[2]: Entering directory '/builds/zonemaster/zonemaster-backend/zonemaster-engine/share'
make[2]: msgfmt: No such file or directory
make[2]: *** [GNUmakefile:32: da.mo] Error 127
make[1]: *** [Makefile:779: pure_all] Error 2
make: *** [Makefile:518: subdirs] Error 2
make[2]: Leaving directory '/builds/zonemaster/zonemaster-backend/zonemaster-engine/share'
make[1]: Leaving directory '/builds/zonemaster/zonemaster-backend/zonemaster-engine'
Cleaning up file based variables
ERROR: Job failed: exit code 1